{"text_format":"1","workbook":"xlsx","n_sheets":5,"sheets":["Sheet1","Sheet2","Sheet3","Sheet4","STOCK POINT PRICE"],"not_rendered":{"charts":0,"images":1,"macros":0,"external_links":2,"defined_names":0,"comments":0,"pivot_tables":0},"unopened":[],"bounds":{"document_bytes":16777216,"sheet_cells":100000,"rows_first":2000,"rows_last":500,"rows_between":2000,"halvings":0,"cell_chars":16384,"cell_head_chars":4096},"cells_cut":0,"cells_raw":0,"read":"whole","date_system":"1900"}

{"sheet":"Sheet1","index":0,"n_rows":65,"n_cols":36,"rows_kept":65,"cut":false,"hidden":false,"merged":[[0,0,0,25],[1,0,1,25],[2,0,2,25],[3,0,3,25],[4,0,4,25],[5,0,5,25],[7,31,7,35],[7,1,7,5],[7,6,7,10],[7,11,7,15],[7,16,7,20],[7,21,7,25],[7,26,7,30]]}
["UNITED BROTHERS"]
["CONSIGNMENT STOCKIST OF GAIL (INDIA) LTD"]
["301,HERITAGE PLAZA, R.S.MAHARAJ MARG,( TELI GALLI CROSS LANE), ANDHERI (E), MUMBAI - 400 069"]
[" TEL:  26844612(4 LINES) FAX: 26822914  E-MAIL:,info@unibrothers.com , prashant@unibrothers.com , jyoti@unibrothers.com"]
["EX-WORKS PRICE OF HDPE \"G-LEX / G-LENE \" W.E.F. 1ST  MAY 2014"]
[]
[null,"Freight",null,2048.77,null,null,"Freight",null,2061.17,null,null,"Freight",null,2537.23,null,null,"Freight",null,1959.23,null,null,"Freight",null,1624.98,null,null,"Freight",null,2247.23,null,null,"           Freight  3069.18"]
[null,"DAMAN",null,null,null,null,"SILVASSA",null,null,null,null,"MUMBAI/BHIWANDI/THANE",null,null,null,null,"JALGAON",null,null,null,null,"NAGPUR",null,null,null,null,"AURANGABAD",null,null,null,null,"SANGLI"]
[null,"BASIC","DISC","LOC","EXCISE","EX-WKS","BASIC","DISC","LOC","EXCISE","EX-WKS","BASIC","DISC","LOC","EXCISE","EX-WKS","BASIC","DISC","LOC","EXCISE","EX-WKS","BASIC","DISC","LOC","EXCISE","EX-WKS","BASIC","DISC","LOC","EXCISE","EX-WKS","BASIC","DISC","LOC","EXCISE","EX-WKS"]
["BM"]
["B52A003A",{"$f":"IF(B$8=\"Daman\",HLOOKUP($A11,'[1]PROPOSED GAIL EX WORKS'!$D$2:$AE$90,3,0))","v":106400},1000,0,{"$f":"(B11-C11-D11)*12.36%","v":13027.439999999999},{"$f":"B11-C11-D11+E11","v":118427.44},{"$f":"IF(G$8=\"SILVASSA\",HLOOKUP($A11,'[1]PROPOSED GAIL EX WORKS'!$D$2:$AE$90,4,0))","v":106400},1000,0,{"$f":"(G11-H11-I11)*12.36%","v":13027.439999999999},{"$f":"G11-H11-I11+J11","v":118427.44},{"$f":"IF(L$8=\"MUMBAI/BHIWANDI/THANE\",HLOOKUP($A11,'[1]PROPOSED GAIL EX WORKS'!$D$2:$AE$90,5,0))","v":105760},1000,0,{"$f":"(L11-M11-N11)*12.36%","v":12948.335999999999},{"$f":"L11-M11-N11+O11","v":117708.336},{"$f":"IF(Q$8=\"JALGAON\",HLOOKUP($A11,'[1]PROPOSED GAIL EX WORKS'!$D$2:$AE$90,6,0))","v":106790},1000,0,{"$f":"(Q11-R11-S11)*12.36%","v":13075.643999999998},{"$f":"Q11-R11-S11+T11","v":118865.644},{"$f":"IF(V$8=\"NAGPUR\",HLOOKUP($A11,'[1]PROPOSED GAIL EX WORKS'!$D$2:$AE$90,7,0))","v":107840},1000,0,{"$f":"(V11-W11-X11)*12.36%","v":13205.423999999999},{"$f":"V11-W11-X11+Y11","v":120045.424},{"$f":"IF(AA$8=\"AURANGABAD\",HLOOKUP($A11,'[1]PROPOSED GAIL EX WORKS'!$D$2:$AE$90,8,0))","v":106410},1000,0,{"$f":"(AA11-AB11-AC11)*12.36%","v":13028.675999999999},{"$f":"AA11-AB11-AC11+AD11","v":118438.67600000001},{"$f":"IF(AF$8=\"SANGLI\",HLOOKUP($A11,'[1]PROPOSED GAIL EX WORKS'!$D$2:$AE$90,9,0))","v":105780},1000,0,{"$f":"(AF11-AG11-AH11)*12.36%","v":12950.807999999999},{"$f":"AF11-AG11-AH11+AI11","v":117730.808}]
["B63A003A",{"$f":"IF(B$8=\"Daman\",HLOOKUP($A12,'[1]PROPOSED GAIL EX WORKS'!$D$2:$AE$90,3,0))","v":106400},1000,0,{"$f":"(B12-C12-D12)*12.36%","v":13027.439999999999},{"$f":"B12-C12-D12+E12","v":118427.44},{"$f":"IF(G$8=\"SILVASSA\",HLOOKUP($A12,'[1]PROPOSED GAIL EX WORKS'!$D$2:$AE$90,4,0))","v":106400},1000,0,{"$f":"(G12-H12-I12)*12.36%","v":13027.439999999999},{"$f":"G12-H12-I12+J12","v":118427.44},{"$f":"IF(L$8=\"MUMBAI/BHIWANDI/THANE\",HLOOKUP($A12,'[1]PROPOSED GAIL EX WORKS'!$D$2:$AE$90,5,0))","v":105760},1000,0,{"$f":"(L12-M12-N12)*12.36%","v":12948.335999999999},{"$f":"L12-M12-N12+O12","v":117708.336},{"$f":"IF(Q$8=\"JALGAON\",HLOOKUP($A12,'[1]PROPOSED GAIL EX WORKS'!$D$2:$AE$90,6,0))","v":106790},1000,0,{"$f":"(Q12-R12-S12)*12.36%","v":13075.643999999998},{"$f":"Q12-R12-S12+T12","v":118865.644},{"$f":"IF(V$8=\"NAGPUR\",HLOOKUP($A12,'[1]PROPOSED GAIL EX WORKS'!$D$2:$AE$90,7,0))","v":107840},1000,0,{"$f":"(V12-W12-X12)*12.36%","v":13205.423999999999},{"$f":"V12-W12-X12+Y12","v":120045.424},{"$f":"IF(AA$8=\"AURANGABAD\",HLOOKUP($A12,'[1]PROPOSED GAIL EX WORKS'!$D$2:$AE$90,8,0))","v":106410},1000,0,{"$f":"(AA12-AB12-AC12)*12.36%","v":13028.675999999999},{"$f":"AA12-AB12-AC12+AD12","v":118438.67600000001},{"$f":"IF(AF$8=\"SANGLI\",HLOOKUP($A12,'[1]PROPOSED GAIL EX WORKS'!$D$2:$AE$90,9,0))","v":105780},1000,0,{"$f":"(AF12-AG12-AH12)*12.36%","v":12950.807999999999},{"$f":"AF12-AG12-AH12+AI12","v":117730.808}]
["B55HM0003A",{"$f":"IF(B$8=\"Daman\",HLOOKUP($A13,'[1]PROPOSED GAIL EX WORKS'!$D$2:$AE$90,3,0))","v":110350},1000,0,{"$f":"(B13-C13-D13)*12.36%","v":13515.659999999998},{"$f":"B13-C13-D13+E13","v":122865.66},{"$f":"IF(G$8=\"SILVASSA\",HLOOKUP($A13,'[1]PROPOSED GAIL EX WORKS'!$D$2:$AE$90,4,0))","v":110360},1000,0,{"$f":"(G13-H13-I13)*12.36%","v":13516.895999999999},{"$f":"G13-H13-I13+J13","v":122876.89599999999},{"$f":"IF(L$8=\"MUMBAI/BHIWANDI/THANE\",HLOOKUP($A13,'[1]PROPOSED GAIL EX WORKS'!$D$2:$AE$90,5,0))","v":109770},1000,0,{"$f":"(L13-M13-N13)*12.36%","v":13443.971999999998},{"$f":"L13-M13-N13+O13","v":122213.97199999999},{"$f":"IF(Q$8=\"JALGAON\",HLOOKUP($A13,'[1]PROPOSED GAIL EX WORKS'!$D$2:$AE$90,6,0))","v":110800},1000,0,{"$f":"(Q13-R13-S13)*12.36%","v":13571.279999999999},{"$f":"Q13-R13-S13+T13","v":123371.28},{"$f":"IF(V$8=\"NAGPUR\",HLOOKUP($A13,'[1]PROPOSED GAIL EX WORKS'!$D$2:$AE$90,7,0))","v":111940},1000,0,{"$f":"(V13-W13-X13)*12.36%","v":13712.183999999999},{"$f":"V13-W13-X13+Y13","v":124652.18399999999},{"$f":"IF(AA$8=\"AURANGABAD\",HLOOKUP($A13,'[1]PROPOSED GAIL EX WORKS'!$D$2:$AE$90,8,0))","v":110410},1000,0,{"$f":"(AA13-AB13-AC13)*12.36%","v":13523.075999999999},{"$f":"AA13-AB13-AC13+AD13","v":122933.076},{"$f":"IF(AF$8=\"SANGLI\",HLOOKUP($A13,'[1]PROPOSED GAIL EX WORKS'!$D$2:$AE$90,9,0))","v":109890},1000,0,{"$f":"(AF13-AG13-AH13)*12.36%","v":13458.803999999998},{"$f":"AF13-AG13-AH13+AI13","v":122348.804}]
["B53EA0035A",{"$f":"IF(B$8=\"Daman\",HLOOKUP($A14,'[1]PROPOSED GAIL EX WORKS'!$D$2:$AE$90,3,0))","v":106900},1000,0,{"$f":"(B14-C14-D14)*12.36%","v":13089.239999999998},{"$f":"B14-C14-D14+E14","v":118989.23999999999},{"$f":"IF(G$8=\"SILVASSA\",HLOOKUP($A14,'[1]PROPOSED GAIL EX WORKS'!$D$2:$AE$90,4,0))","v":106900},1000,0,{"$f":"(G14-H14-I14)*12.36%","v":13089.239999999998},{"$f":"G14-H14-I14+J14","v":118989.23999999999}]
["CABLE-INSUL"]
{"$rows_left_out":51}
{"sheet":"Sheet2","index":1,"n_rows":66,"n_cols":41,"rows_kept":66,"cut":false,"hidden":false,"merged":[[8,26,8,30],[8,16,8,20],[8,21,8,25],[8,31,8,35],[8,36,8,40],[8,1,8,5],[8,6,8,10],[8,11,8,15],[1,0,1,25],[2,0,2,25],[3,0,3,25],[4,0,4,25],[5,0,5,25],[6,0,6,25]]}
[]
["UNITED BROTHERS"]
["CONSIGNMENT STOCKIST OF GAIL (INDIA) LTD"]
["301,HERITAGE PLAZA, R.S.MAHARAJ MARG,( TELI GALLI CROSS LANE), ANDHERI (E), MUMBAI - 400 069"]
["EL:  26844612(4 LINES) FAX: 26822914  E-MAIL: info@unibrothers.com, prashant@unibrothers.com,jyoti@unibrotehers.com"]
["EX-WORKS PRICE OF HDPE \"G-LEX / G-LENE \" W.E.F. 1ST MAY  2014"]
["CASH / ADVANCE PAYMENT FOR MAHARASHTRA & DAMAN"]
[null,"Freight",null,2833.73,null,null,"Freight",null,2016.35,null,null,"Freight",null,2640.33,null,null,"Freight",null,2825.33,null,null,"Freight",null,2282.96,null,null,"                   Freight  ",null,3163.78,null,null,"                    Freight      1986.51",2446.9299999999998,null,null,null,"FREIGHT",2814.81]
[null,"SOLAPUR",null,null,null,null,"UMBERGAON",null,null,null,null,"PUNE",null,null,null,null,"WAI",null,null,null,null,"NASIK",null,null,null,null,"KOLHAPUR",null,null,null,null,"AHMEDNAGAR",null,null,null,null,"ROHA"]
[null,"BASIC","DISC","LOC","EXCISE","EX-WKS","BASIC","DISC","LOC","EXCISE","EX-WKS","BASIC","DISC","LOC","EXCISE","EX-WKS","BASIC","DISC","LOC","EXCISE","EX-WKS","BASIC","DISC","LOC","EXCISE","EX-WKS",null,"DISC","LOC","EXCISE","EX-WKS","BASIC","DISC","LOC","EXCISE","EX-WKS",null,"DISC","LOC","EXCISE","EX-WKS"]
["BM"]
["B52A003A",{"$f":"IF(B$9=\"SOLAPUR\",HLOOKUP($A12,'[2]PROPOSED GAIL EX WORKS'!$D$2:$AE$90,10,0))","v":105780},1000,0,{"$f":"(B12-C12-D12)*12.36%","v":12950.807999999999},{"$f":"B12-C12-D12+E12","v":117730.808},{"$f":"IF(G$9=\"UMBERGAON\",HLOOKUP($A12,'[2]PROPOSED GAIL EX WORKS'!$D$2:$AE$90,11,0))","v":106720},1000,0,{"$f":"(G12-H12-I12)*12.36%","v":13066.991999999998},{"$f":"G12-H12-I12+J12","v":118786.992},{"$f":"IF(L$9=\"PUNE\",HLOOKUP($A12,'[2]PROPOSED GAIL EX WORKS'!$D$2:$AE$90,12,0))","v":105760},1000,0,{"$f":"(L12-M12-N12)*12.36%","v":12948.335999999999},{"$f":"L12-M12-N12+O12","v":117708.336},{"$f":"IF(Q$9=\"WAI\",HLOOKUP($A12,'[2]PROPOSED GAIL EX WORKS'!$D$2:$AE$90,13,0))","v":105760},1000,0,{"$f":"(Q12-R12-S12)*12.36%","v":12948.335999999999},{"$f":"Q12-R12-S12+T12","v":117708.336},{"$f":"IF(V$9=\"NASIK\",HLOOKUP($A12,'[2]PROPOSED GAIL EX WORKS'!$D$2:$AE$90,14,0))","v":106190},1000,0,{"$f":"(V12-W12-X12)*12.36%","v":13001.483999999999},{"$f":"V12-W12-X12+Y12","v":118191.484},{"$f":"IF(AA$9=\"KOLHAPUR\",HLOOKUP($A12,'[2]PROPOSED GAIL EX WORKS'!$D$2:$AE$90,15,0))","v":105610},1000,0,{"$f":"(AA12-AB12-AC12)*12.36%","v":12929.795999999998},{"$f":"AA12-AB12-AC12+AD12","v":117539.796},{"$f":"IF(AF$9=\"AHMEDNAGAR\",HLOOKUP($A12,'[2]PROPOSED GAIL EX WORKS'!$D$2:$AE$90,16,0))","v":106410},1000,0,{"$f":"(AF13-AG12-AH12)*12.36%","v":13028.675999999999},{"$f":"AF13-AG12-AH12+AI12","v":118438.67600000001},{"$f":"IF(AK$9=\"ROHA\",HLOOKUP($A12,'[2]PROPOSED GAIL EX WORKS'!$D$2:$AE$90,17,0))","v":106190},1000,0,{"$f":"(AK12-AL12-AM12)*12.36%","v":13001.483999999999},{"$f":"AK12-AL12-AM12+AN12","v":118191.484}]
["B63A003A",{"$f":"IF(B$9=\"SOLAPUR\",HLOOKUP($A13,'[2]PROPOSED GAIL EX WORKS'!$D$2:$AE$90,10,0))","v":105780},1000,0,{"$f":"(B13-C13-D13)*12.36%","v":12950.807999999999},{"$f":"B13-C13-D13+E13","v":117730.808},{"$f":"IF(G$9=\"UMBERGAON\",HLOOKUP($A13,'[2]PROPOSED GAIL EX WORKS'!$D$2:$AE$90,11,0))","v":106720},1000,0,{"$f":"(G13-H13-I13)*12.36%","v":13066.991999999998},{"$f":"G13-H13-I13+J13","v":118786.992},{"$f":"IF(L$9=\"PUNE\",HLOOKUP($A13,'[2]PROPOSED GAIL EX WORKS'!$D$2:$AE$90,12,0))","v":105760},1000,0,{"$f":"(L13-M13-N13)*12.36%","v":12948.335999999999},{"$f":"L13-M13-N13+O13","v":117708.336},{"$f":"IF(Q$9=\"WAI\",HLOOKUP($A13,'[2]PROPOSED GAIL EX WORKS'!$D$2:$AE$90,13,0))","v":105760},1000,0,{"$f":"(Q13-R13-S13)*12.36%","v":12948.335999999999},{"$f":"Q13-R13-S13+T13","v":117708.336},{"$f":"IF(V$9=\"NASIK\",HLOOKUP($A13,'[2]PROPOSED GAIL EX WORKS'!$D$2:$AE$90,14,0))","v":106190},1000,0,{"$f":"(V13-W13-X13)*12.36%","v":13001.483999999999},{"$f":"V13-W13-X13+Y13","v":118191.484},{"$f":"IF(AA$9=\"KOLHAPUR\",HLOOKUP($A13,'[2]PROPOSED GAIL EX WORKS'!$D$2:$AE$90,15,0))","v":105610},1000,0,{"$f":"(AA13-AB13-AC13)*12.36%","v":12929.795999999998},{"$f":"AA13-AB13-AC13+AD13","v":117539.796},{"$f":"IF(AF$9=\"AHMEDNAGAR\",HLOOKUP($A13,'[2]PROPOSED GAIL EX WORKS'!$D$2:$AE$90,16,0))","v":106410},1000,0,{"$f":"(AF14-AG13-AH13)*12.36%","v":13523.075999999999},{"$f":"AF14-AG13-AH13+AI13","v":122933.076},{"$f":"IF(AK$9=\"ROHA\",HLOOKUP($A13,'[2]PROPOSED GAIL EX WORKS'!$D$2:$AE$90,17,0))","v":106190},1000,0,{"$f":"(AK13-AL13-AM13)*12.36%","v":13001.483999999999},{"$f":"AK13-AL13-AM13+AN13","v":118191.484}]
["B55HM0003A",{"$f":"IF(B$9=\"SOLAPUR\",HLOOKUP($A14,'[2]PROPOSED GAIL EX WORKS'!$D$2:$AE$90,10,0))","v":109890},1000,0,{"$f":"(B14-C14-D14)*12.36%","v":13458.803999999998},{"$f":"B14-C14-D14+E14","v":122348.804},{"$f":"IF(G$9=\"UMBERGAON\",HLOOKUP($A14,'[2]PROPOSED GAIL EX WORKS'!$D$2:$AE$90,11,0))","v":111090},1000,0,{"$f":"(G14-H14-I14)*12.36%","v":13607.123999999998},{"$f":"G14-H14-I14+J14","v":123697.124},{"$f":"IF(L$9=\"PUNE\",HLOOKUP($A14,'[2]PROPOSED GAIL EX WORKS'!$D$2:$AE$90,12,0))","v":109790},1000,0,{"$f":"(L14-M14-N14)*12.36%","v":13446.444},{"$f":"L14-M14-N14+O14","v":122236.444},{"$f":"IF(Q$9=\"WAI\",HLOOKUP($A14,'[2]PROPOSED GAIL EX WORKS'!$D$2:$AE$90,13,0))","v":109790},1000,0,{"$f":"(Q14-R14-S14)*12.36%","v":13446.444},{"$f":"Q14-R14-S14+T14","v":122236.444},{"$f":"IF(V$9=\"NASIK\",HLOOKUP($A14,'[2]PROPOSED GAIL EX WORKS'!$D$2:$AE$90,14,0))","v":110140},1000,0,{"$f":"(V14-W14-X14)*12.36%","v":13489.703999999998},{"$f":"V14-W14-X14+Y14","v":122629.704},{"$f":"IF(AA$9=\"KOLHAPUR\",HLOOKUP($A14,'[2]PROPOSED GAIL EX WORKS'!$D$2:$AE$90,15,0))","v":109580},1000,0,{"$f":"(AA14-AB14-AC14)*12.36%","v":13420.487999999999},{"$f":"AA14-AB14-AC14+AD14","v":122000.488},{"$f":"IF(AF$9=\"AHMEDNAGAR\",HLOOKUP($A14,'[2]PROPOSED GAIL EX WORKS'!$D$2:$AE$90,16,0))","v":110410},1000,0,{"$f":"(AF14-AG14-AH14)*12.36%","v":13523.075999999999},{"$f":"AF14-AG14-AH14+AI14","v":122933.076},{"$f":"IF(AK$9=\"ROHA\",HLOOKUP($A14,'[2]PROPOSED GAIL EX WORKS'!$D$2:$AE$90,17,0))","v":110140},1000,0,{"$f":"(AK14-AL14-AM14)*12.36%","v":13489.703999999998},{"$f":"AK14-AL14-AM14+AN14","v":122629.704}]
["B53EA0035A",null,null,null,null,null,{"$f":"IF(G$9=\"UMBERGAON\",HLOOKUP($A15,'[2]PROPOSED GAIL EX WORKS'!$D$2:$AE$90,11,0))","v":107220},1000,0,{"$f":"(G15-H15-I15)*12.36%","v":13128.791999999999},{"$f":"G15-H15-I15+J15","v":119348.792}]
{"$rows_left_out":52}
{"sheet":"Sheet3","index":2,"n_rows":66,"n_cols":31,"rows_kept":66,"cut":false,"hidden":false,"merged":[[1,0,1,20],[2,0,2,20],[8,21,8,25],[3,0,3,20],[4,0,4,20],[6,0,6,20],[8,6,8,10],[8,11,8,15],[8,26,8,30],[8,16,8,20],[5,0,5,25]]}
[]
["UNITED BROTHERS"]
[]
["301,HERITAGE PLAZA, R.S.MAHARAJ MARG,( TELI GALLI CROSS LANE), ANDHERI (E), MUMBAI - 400 069"]
["EL:  26844612(4 LINES) FAX: 26822914  E-MAIL: info@unibrothers.com , prashant@unibrothers.com, jyoti@unibrothers.com"]
["EX-WORKS PRICE OF HDPE \"G-LEX / G-LENE \" W.E.F. 1ST MAY 2014"]
["CASH / ADVANCE PAYMENT FOR MAHARASHTRA & DAMAN"]
[null,"Freight",null,2507.0500000000002,null,null,"Freight",null,4749.82,null,null,"Freight",null,2573.77,null,null,"          Freight  1210.75",null,null,null,null,"Freight",null,5162.96,null,null,"Freight"]
[null,null,null,"BARJORA",null,null,"HOSUR",null,null,null,null,"JAMMU",null,null,null,null,"NOIDA",null,null,null,null,"PONDICHERRY",null,null,null,null,"BARODA"]
[null,"BASIC","DISC","LOC","EXCISE","EX-WKS","BASIC","DISC","LOC","EXCISE","EX-WKS","BASIC","DISC","LOC","EXCISE","EX-WKS","BASIC","DISC","LOC","EXCISE","EX-WKS",null,"DISC","LOC","EXCISE","EX-WKS",null,"DISC","LOC","EXCISE","EX-WKS"]
["BM"]
["B52A003A",{"$f":"IF(D$9=\"BARJORA\",HLOOKUP($A12,'[2]PROPOSED GAIL EX WORKS'!$D$2:$AE$90,18,0))","v":105380},1000,0,{"$f":"(B12-C12-D12)*12.36%","v":12901.367999999999},{"$f":"B12-C12-D12+E12","v":117281.368},{"$f":"IF(G$9=\"HOSUR\",HLOOKUP($A12,'[2]PROPOSED GAIL EX WORKS'!$D$2:$AE$90,19,0))","v":103660},1000,0,{"$f":"(G12-H12-I12)*12.36%","v":12688.775999999998},{"$f":"G12-H12-I12+J12","v":115348.776},{"$f":"IF(L$9=\"JAMMU\",HLOOKUP($A12,'[2]PROPOSED GAIL EX WORKS'!$D$2:$AE$90,20,0))","v":108780},1000,0,{"$f":"(L12-M12-N12)*12.36%","v":13321.607999999998},{"$f":"L12-M12-N12+O12","v":121101.60799999999},{"$f":"IF(Q$9=\"NOIDA\",HLOOKUP($A12,'[2]PROPOSED GAIL EX WORKS'!$D$2:$AE$90,21,0))","v":108740},1000,0,{"$f":"(Q12-R12-S12)*12.36%","v":13316.663999999999},{"$f":"Q12-R12-S12+T12","v":121056.664},{"$f":"IF(V$9=\"PONDICHERRY\",HLOOKUP($A12,'[2]PROPOSED GAIL EX WORKS'!$D$2:$AE$90,22,0))","v":103790},1000,0,{"$f":"(V12-W12-X12)*12.36%","v":12704.843999999999},{"$f":"V12-W12-X12+Y12","v":115494.844},{"$f":"IF(AA$9=\"BARODA\",HLOOKUP($A12,'[2]PROPOSED GAIL EX WORKS'!$D$2:$AE$90,23,0))","v":107200},1000,0,{"$f":"(AA12-AB12-AC12)*12.36%","v":13126.319999999998},{"$f":"AA12-AB12-AC12+AD12","v":119326.31999999999}]
["B63A003A",{"$f":"IF(D$9=\"BARJORA\",HLOOKUP($A13,'[2]PROPOSED GAIL EX WORKS'!$D$2:$AE$90,18,0))","v":105380},1000,0,{"$f":"(B13-C13-D13)*12.36%","v":12901.367999999999},{"$f":"B13-C13-D13+E13","v":117281.368},{"$f":"IF(G$9=\"HOSUR\",HLOOKUP($A13,'[2]PROPOSED GAIL EX WORKS'!$D$2:$AE$90,19,0))","v":103660},1000,0,{"$f":"(G13-H13-I13)*12.36%","v":12688.775999999998},{"$f":"G13-H13-I13+J13","v":115348.776},{"$f":"IF(L$9=\"JAMMU\",HLOOKUP($A13,'[2]PROPOSED GAIL EX WORKS'!$D$2:$AE$90,20,0))","v":108780},1000,0,{"$f":"(L13-M13-N13)*12.36%","v":13321.607999999998},{"$f":"L13-M13-N13+O13","v":121101.60799999999},{"$f":"IF(Q$9=\"NOIDA\",HLOOKUP($A13,'[2]PROPOSED GAIL EX WORKS'!$D$2:$AE$90,21,0))","v":108740},1000,0,{"$f":"(Q13-R13-S13)*12.36%","v":13316.663999999999},{"$f":"Q13-R13-S13+T13","v":121056.664},{"$f":"IF(V$9=\"PONDICHERRY\",HLOOKUP($A13,'[2]PROPOSED GAIL EX WORKS'!$D$2:$AE$90,22,0))","v":103790},1000,0,{"$f":"(V13-W13-X13)*12.36%","v":12704.843999999999},{"$f":"V13-W13-X13+Y13","v":115494.844},{"$f":"IF(AA$9=\"BARODA\",HLOOKUP($A13,'[2]PROPOSED GAIL EX WORKS'!$D$2:$AE$90,23,0))","v":107200},1000,0,{"$f":"(AA13-AB13-AC13)*12.36%","v":13126.319999999998},{"$f":"AA13-AB13-AC13+AD13","v":119326.31999999999}]
["B55HM0003A",{"$f":"IF(D$9=\"BARJORA\",HLOOKUP($A14,'[2]PROPOSED GAIL EX WORKS'!$D$2:$AE$90,18,0))","v":111670},1000,0,{"$f":"(B14-C14-D14)*12.36%","v":13678.811999999998},{"$f":"B14-C14-D14+E14","v":124348.81200000001},{"$f":"IF(G$9=\"HOSUR\",HLOOKUP($A14,'[2]PROPOSED GAIL EX WORKS'!$D$2:$AE$90,19,0))","v":107900},1000,0,{"$f":"(G14-H14-I14)*12.36%","v":13212.839999999998},{"$f":"G14-H14-I14+J14","v":120112.84},{"$f":"IF(L$9=\"JAMMU\",HLOOKUP($A14,'[2]PROPOSED GAIL EX WORKS'!$D$2:$AE$90,20,0))","v":112920},1000,0,{"$f":"(L14-M14-N14)*12.36%","v":13833.311999999998},{"$f":"L14-M14-N14+O14","v":125753.31200000001},{"$f":"IF(Q$9=\"NOIDA\",HLOOKUP($A14,'[2]PROPOSED GAIL EX WORKS'!$D$2:$AE$90,21,0))","v":112970},1000,0,{"$f":"(Q14-R14-S14)*12.36%","v":13839.491999999998},{"$f":"Q14-R14-S14+T14","v":125809.492},{"$f":"IF(V$9=\"PONDICHERRY\",HLOOKUP($A14,'[2]PROPOSED GAIL EX WORKS'!$D$2:$AE$90,22,0))","v":108930},1000,0,{"$f":"(V14-W14-X14)*12.36%","v":13340.147999999999},{"$f":"V14-W14-X14+Y14","v":121270.148},{"$f":"IF(AA$9=\"BARODA\",HLOOKUP($A14,'[2]PROPOSED GAIL EX WORKS'!$D$2:$AE$90,23,0))","v":111060},1000,0,{"$f":"(AA14-AB14-AC14)*12.36%","v":13603.415999999999},{"$f":"AA14-AB14-AC14+AD14","v":123663.416}]
["CABLE-INSUL"]
{"$rows_left_out":52}
{"sheet":"Sheet4","index":3,"n_rows":64,"n_cols":26,"rows_kept":64,"cut":false,"hidden":false,"merged":[[0,0,0,25],[1,0,1,25],[2,0,2,25],[3,0,3,25],[4,0,4,25],[5,0,5,25],[7,1,7,5],[7,6,7,10],[7,11,7,15],[7,16,7,20],[7,21,7,25]]}
["UNITED BROTHERS"]
["CONSIGNMENT STOCKIST OF GAIL (INDIA) LTD"]
["301,HERITAGE PLAZA, R.S.MAHARAJ MARG,( TELI GALLI CROSS LANE), ANDHERI (E), MUMBAI - 400 069"]
[" TEL:  26844612(4 LINES) FAX: 26822914  E-MAIL: info@unibrothers.com ,prashant@unibrothers.com ,jyoti@unibrothers.com"]
["EX-WORKS PRICE OF HDPE \"G-LEX / G-LENE \" W.E.F. 1ST MAY 2014"]
["CASH / ADVANCE PAYMENT FOR MAHARASHTRA & DAMAN"]
[null,"                Freight  985.53",null,null,null,null,"                            Freight   3199.90",null,null,null,null,"                      ",null,"FREIGHT 1758.96",null,null,null,"FREIGHT 5424.7",null,null,null,"            Freight  2024.85"]
[null,"ALWAR",null,null,null,null,"HYDERABAD",null,null,null,null,"BADDI",null,null,null,null,"UDMALPET",null,null,null,null,"BHAVNAGAR"]
[null,"BASIC","DISC","LOC","EXCISE","EX-WKS","BASIC","DISC","LOC","EXCISE","EX-WKS","BASIC","DISC","LOC","EXCISE","EX-WKS","BASIC","DISC","LOC","EXCISE","EX-WKS",null,"DISC","LOC","EXCISE","EX-WKS"]
["BM"]
["B52A003A",{"$f":"IF(B$8=\"ALWAR\",HLOOKUP($A11,'[2]PROPOSED GAIL EX WORKS'!$D$2:$AE$90,24,0))","v":108970},1000,0,{"$f":"(B11-C11-D11)*12.36%","v":13345.091999999999},{"$f":"B11-C11-D11+E11","v":121315.092},{"$f":"IF(G$8=\"HYDERABAD\",HLOOKUP($A11,'[2]PROPOSED GAIL EX WORKS'!$D$2:$AE$90,25,0))","v":105900},1000,0,{"$f":"(G11-H11-I11)*12.36%","v":12965.64},{"$f":"G11-H11-I11+J11","v":117865.64},{"$f":"IF(L$8=\"BADDI\",HLOOKUP($A11,'[2]PROPOSED GAIL EX WORKS'!$D$2:$AE$90,26,0))","v":108520},1000,0,{"$f":"(L11-M11-N11)*12.36%","v":13289.471999999998},{"$f":"L11-M11-N11+O11","v":120809.47199999999},{"$f":"IF(Q$8=\"UDMALPET\",HLOOKUP($A11,'[2]PROPOSED GAIL EX WORKS'!$D$2:$AE$90,27,0))","v":103710},1000,0,{"$f":"(Q11-R11-S11)*12.36%","v":12694.955999999998},{"$f":"Q11-R11-S11+T11","v":115404.95600000001},{"$f":"IF(V$8=\"BHAVNAGAR\",HLOOKUP($A11,'[2]PROPOSED GAIL EX WORKS'!$D$2:$AE$90,28,0))","v":107110},1000,0,{"$f":"(V11-W11-X11)*12.36%","v":13115.195999999998},{"$f":"V11-W11-X11+Y11","v":119225.196}]
["B63A003A",{"$f":"IF(B$8=\"ALWAR\",HLOOKUP($A12,'[2]PROPOSED GAIL EX WORKS'!$D$2:$AE$90,24,0))","v":108970},1000,0,{"$f":"(B12-C12-D12)*12.36%","v":13345.091999999999},{"$f":"B12-C12-D12+E12","v":121315.092},{"$f":"IF(G$8=\"HYDERABAD\",HLOOKUP($A12,'[2]PROPOSED GAIL EX WORKS'!$D$2:$AE$90,25,0))","v":105900},1000,0,{"$f":"(G12-H12-I12)*12.36%","v":12965.64},{"$f":"G12-H12-I12+J12","v":117865.64},{"$f":"IF(L$8=\"BADDI\",HLOOKUP($A12,'[2]PROPOSED GAIL EX WORKS'!$D$2:$AE$90,26,0))","v":108520},1000,0,{"$f":"(L12-M12-N12)*12.36%","v":13289.471999999998},{"$f":"L12-M12-N12+O12","v":120809.47199999999},{"$f":"IF(Q$8=\"UDMALPET\",HLOOKUP($A12,'[2]PROPOSED GAIL EX WORKS'!$D$2:$AE$90,27,0))","v":103710},1000,0,{"$f":"(Q12-R12-S12)*12.36%","v":12694.955999999998},{"$f":"Q12-R12-S12+T12","v":115404.95600000001},{"$f":"IF(V$8=\"BHAVNAGAR\",HLOOKUP($A12,'[2]PROPOSED GAIL EX WORKS'!$D$2:$AE$90,28,0))","v":107110},1000,0,{"$f":"(V12-W12-X12)*12.36%","v":13115.195999999998},{"$f":"V12-W12-X12+Y12","v":119225.196}]
["B55HM0003A",{"$f":"IF(B$8=\"ALWAR\",HLOOKUP($A13,'[2]PROPOSED GAIL EX WORKS'!$D$2:$AE$90,24,0))","v":113170},1000,0,{"$f":"(B13-C13-D13)*12.36%","v":13864.211999999998},{"$f":"B13-C13-D13+E13","v":126034.212},{"$f":"IF(G$8=\"HYDERABAD\",HLOOKUP($A13,'[2]PROPOSED GAIL EX WORKS'!$D$2:$AE$90,25,0))","v":109940},1000,0,{"$f":"(G13-H13-I13)*12.36%","v":13464.983999999999},{"$f":"G13-H13-I13+J13","v":122404.984},{"$f":"IF(L$8=\"BADDI\",HLOOKUP($A13,'[2]PROPOSED GAIL EX WORKS'!$D$2:$AE$90,26,0))","v":113180},1000,0,{"$f":"(L13-M13-N13)*12.36%","v":13865.447999999999},{"$f":"L13-M13-N13+O13","v":126045.448},{"$f":"IF(Q$8=\"UDMALPET\",HLOOKUP($A13,'[2]PROPOSED GAIL EX WORKS'!$D$2:$AE$90,27,0))","v":107860},1000,0,{"$f":"(Q13-R13-S13)*12.36%","v":13207.895999999999},{"$f":"Q13-R13-S13+T13","v":120067.89599999999},{"$f":"IF(V$8=\"BHAVNAGAR\",HLOOKUP($A13,'[2]PROPOSED GAIL EX WORKS'!$D$2:$AE$90,28,0))","v":110970},1000,0,{"$f":"(V13-W13-X13)*12.36%","v":13592.291999999999},{"$f":"V13-W13-X13+Y13","v":123562.292}]
["CABLE-INSUL"]
["C43D006A",{"$f":"IF(B$8=\"ALWAR\",HLOOKUP($A15,'[2]PROPOSED GAIL EX WORKS'!$D$2:$AE$90,24,0))","v":106593.5},1000,0,{"$f":"(B15-C15-D15)*12.36%","v":13051.356599999999},{"$f":"B15-C15-D15+E15","v":118644.8566},{"$f":"IF(G$8=\"HYDERABAD\",HLOOKUP($A15,'[2]PROPOSED GAIL EX WORKS'!$D$2:$AE$90,25,0))","v":103487},1000,0,{"$f":"(G15-H15-I15)*12.36%","v":12667.393199999999},{"$f":"G15-H15-I15+J15","v":115154.39319999999},{"$f":"IF(L$8=\"BADDI\",HLOOKUP($A15,'[2]PROPOSED GAIL EX WORKS'!$D$2:$AE$90,26,0))","v":106641},1000,0,{"$f":"(L15-M15-N15)*12.36%","v":13057.227599999998},{"$f":"L15-M15-N15+O15","v":118698.2276},{"$f":"IF(Q$8=\"UDMALPET\",HLOOKUP($A15,'[2]PROPOSED GAIL EX WORKS'!$D$2:$AE$90,27,0))","v":101321},1000,0,{"$f":"(Q15-R15-S15)*12.36%","v":12399.675599999999},{"$f":"Q15-R15-S15+T15","v":112720.6756},{"$f":"IF(V$8=\"BHAVNAGAR\",HLOOKUP($A15,'[2]PROPOSED GAIL EX WORKS'!$D$2:$AE$90,28,0))","v":104285},1000,0,{"$f":"(V15-W15-X15)*12.36%","v":12766.025999999998},{"$f":"V15-W15-X15+Y15","v":116051.026}]
{"$rows_left_out":50}
{"sheet":"STOCK POINT PRICE","index":4,"n_rows":85,"n_cols":13,"rows_kept":85,"cut":false,"hidden":false,"merged":[[44,6,44,7],[1,0,1,10],[2,0,2,10],[3,0,3,10],[4,0,4,10],[5,0,5,10]]}
[]
["UNITED BROTHERS"]
["CONSIGNMENT STOCKIST OF GAIL (INDIA) LTD"]
["301,HERITAGE PLAZA, R.S.MAHARAJ MARG,( TELI GALLI CROSS LANE), ANDHERI (E), MUMBAI - 400 069"]
["               TEL:  26844612(4 LINES) FAX: 26822914  E-MAIL:info@unibrothers.com,prashant@unibrothers.com,jyoti@unibrothers.com"]
["PRICE OF HDPE \"G-LEX / G-LENE \" W.E.F 1ST MAY  2014"]
[]
[null,null,"DAMAN","BHIWANDI","PUNE"]
[null,null,"ST.PT.","ST.PT.","ST.PT.",null,"   FREIGHT"]
[null,"BM",null,null,null,null,"ALWAR",985.53]
[null,"B52A003A",121860,121690,121800,null,"BHAVNAGAR",2024.85]
[null,"B52A003NA",121860,121690,121800,null,"BADDI",1758.96]
[null,"B63A003A",121860,121690,121800,null,"DAMAN",2048.77]
[null,"B63A003NA",121860,121690,121800,null,"SILVASSA",2061.17]
[null,"B55HM0003A",126300,126190,126330,null,"BHIWANDI",2537.23]
{"$rows_left_out":70}